add CI

7 jobs for master in 19 minutes (queued for 1 second)
Status Name Job ID Coverage
  Test
passed debianOldOldStable #71145

00:17:07

passed debianOldStable #71144

00:18:59

failed debianStable #71142

00:14:33

failed debianTesting #71143

00:14:33

passed thesisPDF #71139

00:01:05

passed ubuntuLatest #71140

00:13:58

failed ubuntuRolling #71141

00:12:38

 
Name Stage Failure
failed
debianTesting Test
Collected error summary (may duplicate other messages):
pdflatex: Command for 'pdflatex' gave return code 1
Refer to 'thesis.log' for details
Latexmk: Use the -f option to force complete processing,
unless error was exceeding maximum runs, or warnings treated as errors.
=== TeX engine is 'pdfTeX'
Latexmk: Errors, so I did not complete making targets
make: *** [Makefile:10: thesis.pdf] Error 12
ERROR: Job failed: exit code 1
failed
debianStable Test
Collected error summary (may duplicate other messages):
pdflatex: Command for 'pdflatex' gave return code 1
Refer to 'thesis.log' for details
Latexmk: Use the -f option to force complete processing,
unless error was exceeding maximum runs, or warnings treated as errors.
=== TeX engine is 'pdfTeX'
Latexmk: Errors, so I did not complete making targets
make: *** [Makefile:10: thesis.pdf] Error 12
ERROR: Job failed: exit code 1
failed
ubuntuRolling Test
Collected error summary (may duplicate other messages):
pdflatex: Command for 'pdflatex' gave return code 1
Refer to 'thesis.log' for details
Latexmk: Use the -f option to force complete processing,
unless error was exceeding maximum runs, or warnings treated as errors.
=== TeX engine is 'pdfTeX'
Latexmk: Errors, so I did not complete making targets
make: *** [Makefile:10: thesis.pdf] Error 12
ERROR: Job failed: exit code 1